{"text_format":"1","workbook":"xlsx","n_sheets":9,"sheets":["Notes","Funds","Defenders","Players","Owners","Results","Signed","SquadSize","Spending"],"not_rendered":{"charts":0,"images":1,"macros":1,"external_links":0,"defined_names":9,"comments":0,"pivot_tables":2},"unopened":[],"bounds":{"document_bytes":16777216,"sheet_cells":100000,"rows_first":2000,"rows_last":500,"rows_between":2000,"halvings":0,"cell_chars":16384,"cell_head_chars":4096},"cells_cut":0,"cells_raw":0,"read":"whole","date_system":"1900"}

{"sheet":"Notes","index":0,"n_rows":20,"n_cols":2,"rows_kept":20,"cut":false,"hidden":false,"merged":[]}
["Email Auction Notes and Rules"]
[]
[null,"DL2020 January Auction R1"]
[]
["Funds:","Check the Funds tab to see the amount of money you have left to spend"]
[]
["Defenders:","The 'Defenders Free' tab (if completed) shows how many keepers and defenders can still be bought for each team. Only 5 defenders are permitted in the pool from any one real club"]
[]
["Players:","To make a bid for a player, select your name from the drop-down list."]
[null,"You can only bid for a maximum of two goalkeepers in the pre-season Goalkeeper auction"]
[null,"Enter the Bid amount in mulitples of £100k, where £100k=0.1, £1,000,000=1.0, £5,100,000=5.1"]
[null,"If a successful bid will take your overall squad number to more than 18 you must be available at bid-closing time to nominate a player to release. If you know already who you plan to release, enter the player's name in the Release column"]
["Signed:","All owned players prior to this auction, for information"]
[]
["Squads: ","Number of players by position per Owner prior to this auction, for information"]
[]
["Submitting:","When you have completed your bids:- \nsave the document by adding your name to the end of the file name - \"2020 Email Auction - January R1 - <Griff>\"\nsend it to Chris Griffin at cgriffin18@hotmail.com"]
[]
["Deadlines:","Round 1 bids - 5pm, Sunday, 26th January"]
[null,"Round 2 bids - 5pm, Sunday, 3rd February"]

{"sheet":"Funds","index":1,"n_rows":18,"n_cols":25,"rows_kept":18,"cut":false,"hidden":false,"merged":[[0,13,0,15],[0,16,0,18],[1,23,1,24],[0,10,0,11],[0,5,0,9]]}
[null,null,null,null,null,"Squad (Pre-this auction)",null,null,null,null,"Auction Night",null,null,"Autumn Window",null,null,"January Window"]
["ID","Owner","Team Name","Opening","Balance","GK","Def","Mid","Fwd","Total","GK\\Night","Mopup1","Mopup2","R1","R2","R3","R1","R2","R3","Balance",null,"Spend",null,"Latest Round Spend"]
["ACL","Andy Clucas","Breast Homage Albion",40,{"$f":"T3","v":9.9999999999994316E-2},3,5,3,7,{"$f":"SUM(F3:I3)","v":18},39.200000000000003,0,0.6,0,0.1,null,null,null,null,{"$f":"D3-SUM(K3:S3)","v":9.9999999999994316E-2},null,{"$f":"IF(ISERROR(INDEX(Spending!C:C,MATCH(B3,Spending!A:A,0))),0,INDEX(Spending!C:C,MATCH(B3,Spending!A:A,0)))","v":0},null,{"$f":"B3","v":"Andy Clucas"},{"$f":"IF(V3=0,\"\",V3)","v":""}]
["CH","Carl Hogg","Hogg's Roast FC",40,2.8999999999999986,2,4,5,7,18,36,0.4,0.1,0.6,0,null,null,null,null,2.8999999999999986,null,{"$f":"IF(ISERROR(INDEX(Spending!C:C,MATCH(B4,Spending!A:A,0))),0,INDEX(Spending!C:C,MATCH(B4,Spending!A:A,0)))","v":0},null,{"$f":"B4","v":"Carl Hogg"},{"$f":"IF(V4=0,\"\",V4)","v":""}]
["CP","Charlotte Phillips","FC Hammer",40,0.69999999999999574,1,3,4,6,14,39.300000000000004,0,0,0,0,null,null,null,null,0.69999999999999574,null,{"$f":"IF(ISERROR(INDEX(Spending!C:C,MATCH(B5,Spending!A:A,0))),0,INDEX(Spending!C:C,MATCH(B5,Spending!A:A,0)))","v":0},null,"Charlotte Phillips",""]
["CG","Chris Griffin","The Jordi Gomez Love-in",40,0.40000000000001279,2,4,4,8,18,34.699999999999996,3.8,0.3,0.5,0.30000000000000004,null,null,null,null,0.40000000000001279,null,{"$f":"IF(ISERROR(INDEX(Spending!C:C,MATCH(B6,Spending!A:A,0))),0,INDEX(Spending!C:C,MATCH(B6,Spending!A:A,0)))","v":0},null,"Chris Griffin",""]
["DS","Dave Sumner","People's Front of Springfield",40,1.9999999999999929,2,5,4,7,18,34.400000000000006,1.5,0.1,2,0,null,null,null,null,1.9999999999999929,null,{"$f":"IF(ISERROR(INDEX(Spending!C:C,MATCH(B7,Spending!A:A,0))),0,INDEX(Spending!C:C,MATCH(B7,Spending!A:A,0)))","v":0},null,"Dave Sumner",""]
["GM","Graham Miller","Sporting Anattyjacket",40,10.499999999999996,2,3,4,7,16,28.400000000000002,0,0.6,0,0.5,null,null,null,null,10.499999999999996,null,{"$f":"IF(ISERROR(INDEX(Spending!C:C,MATCH(B8,Spending!A:A,0))),0,INDEX(Spending!C:C,MATCH(B8,Spending!A:A,0)))","v":0},null,"Graham Miller",""]
["HB","Howard Bradley","Brush It, Munch And Gag Back",40,4.3000000000000043,2,4,4,8,18,28.799999999999997,6.5,0,0.3,0.1,null,null,null,null,4.3000000000000043,null,{"$f":"IF(ISERROR(INDEX(Spending!C:C,MATCH(B9,Spending!A:A,0))),0,INDEX(Spending!C:C,MATCH(B9,Spending!A:A,0)))","v":0},null,"Howard Bradley",""]
["JM","John Murphy","Jean Pierre's Tap-ins",40,3,2,3,5,7,17,35,1.4000000000000001,0.6,0,0,null,null,null,null,3,null,{"$f":"IF(ISERROR(INDEX(Spending!C:C,MATCH(B10,Spending!A:A,0))),0,INDEX(Spending!C:C,MATCH(B10,Spending!A:A,0)))","v":0},null,"John Murphy",""]
["JF","Jonny Fairclough","Fortuna Dufflecoat",40,1.6999999999999957,2,4,3,6,15,38.300000000000004,0,0,0,0,null,null,null,null,1.6999999999999957,null,{"$f":"IF(ISERROR(INDEX(Spending!C:C,MATCH(B11,Spending!A:A,0))),0,INDEX(Spending!C:C,MATCH(B11,Spending!A:A,0)))","v":0},null,"Jonny Fairclough",""]
["JB","Liam Murphy","10 Man Wigan",40,1.0000000000000071,2,5,4,7,18,36.499999999999993,0,0,2.5,0,null,null,null,null,1.0000000000000071,null,{"$f":"IF(ISERROR(INDEX(Spending!C:C,MATCH(B12,Spending!A:A,0))),0,INDEX(Spending!C:C,MATCH(B12,Spending!A:A,0)))","v":0},null,"Liam Murphy",""]
["MS","Mo Sudell","Locomotive Leighpzig",40,7.8999999999999986,2,3,5,8,18,30.4,1.1000000000000001,0.30000000000000004,0.30000000000000004,0,null,null,null,null,7.8999999999999986,null,{"$f":"IF(ISERROR(INDEX(Spending!C:C,MATCH(B13,Spending!A:A,0))),0,INDEX(Spending!C:C,MATCH(B13,Spending!A:A,0)))","v":0},null,"Mo Sudell",""]
["NH","Nigel Heyes","Real Madridicule United",40,0,2,3,3,5,13,40,0,0,0,0,null,null,null,null,0,null,{"$f":"IF(ISERROR(INDEX(Spending!C:C,MATCH(B14,Spending!A:A,0))),0,INDEX(Spending!C:C,MATCH(B14,Spending!A:A,0)))","v":0},null,"Nigel Heyes",""]
["NHU","Nigel Hughes","Atletico Standish",40,1.5999999999999943,2,3,4,8,17,37,0.2,0,0.7,0.5,null,null,null,null,1.5999999999999943,null,{"$f":"IF(ISERROR(INDEX(Spending!C:C,MATCH(B15,Spending!A:A,0))),0,INDEX(Spending!C:C,MATCH(B15,Spending!A:A,0)))","v":0},null,"Nigel Hughes",""]
["PFA","Paul Fairhurst","Earby Blues",40,0,2,4,5,7,18,30.700000000000003,9.3000000000000007,0,0,0,null,null,null,null,0,null,{"$f":"IF(ISERROR(INDEX(Spending!C:C,MATCH(B16,Spending!A:A,0))),0,INDEX(Spending!C:C,MATCH(B16,Spending!A:A,0)))","v":0},null,"Paul Fairhurst",""]
["PG","Paul Greenwood","Abe Frohman's Sausage Kings",40,2.5999999999999943,2,3,4,9,18,27.4,9.8000000000000007,0,0.2,0,null,null,null,null,2.5999999999999943,null,{"$f":"IF(ISERROR(INDEX(Spending!C:C,MATCH(B17,Spending!A:A,0))),0,INDEX(Spending!C:C,MATCH(B17,Spending!A:A,0)))","v":0},null,"Paul Greenwood",""]
["SW","Steve Waterhouse","20Legend",40,0,2,4,5,7,18,38,2,0,0,0,null,null,null,null,0,null,{"$f":"IF(ISERROR(INDEX(Spending!C:C,MATCH(B18,Spending!A:A,0))),0,INDEX(Spending!C:C,MATCH(B18,Spending!A:A,0)))","v":0},null,"Steve Waterhouse",""]

{"sheet":"Defenders","index":2,"n_rows":45,"n_cols":10,"rows_kept":45,"cut":false,"hidden":false,"merged":[]}
["Team","GK Signed","Def Signed","GK Available","Def Available",null,null,"From DLC Pool Pivot ↓ (admin only)"]
["Arsenal",1,2,{"$f":"IF(1-B2=0,\"\",1-B2)","v":""},{"$f":"IF(5-C2=0,\"\",5-C2)","v":3},null,null,"Arsenal",3,1]
["Aston Villa",1,null,{"$f":"IF(1-B3=0,\"\",1-B3)","v":""},{"$f":"IF(5-C3=0,\"\",5-C3)","v":5},null,null,"Aston Villa",1,2]
["Barnsley",null,null,1,5,null,null,"Barnsley",1]
["Birmingham City",1,1,"",4,null,null,"Birmingham City",1]
["Blackburn Rovers",1,null,"",5,null,null,"Blackburn Rovers",2,1]
["Bournemouth",null,null,1,5,null,null,"Bournemouth",2,2]
["Brentford",null,null,1,5,null,null,"Brentford",4]
["Brighton & Hove Albion",1,1,"",4,null,null,"Brighton & Hove Albion",2,1]
["Bristol City",1,1,"",4,null,null,"Bristol City",3,1]
["Burnley",1,3,"",2,null,null,"Burnley",3]
["Cardiff City",1,2,"",3,null,null,"Cardiff City",2,2]
["Charlton Athletic",1,null,"",5,null,null,"Charlton Athletic",2,1]
["Chelsea",1,2,"",3,null,null,"Chelsea",3,5]
["Crystal Palace",1,1,"",4,null,null,"Crystal Palace",3,3]
["Derby County",null,null,1,5,null,null,"Derby County",3,1]
["Everton",1,4,"",1,null,null,"Everton",4,1]
["Fulham",1,3,"",2,null,null,"Fulham",4,2]
["Huddersfield Town",1,1,"",4,null,null,"Huddersfield Town",2]
["Hull City",null,null,1,5,null,null,"Hull City",4]
["Leeds United",1,3,"",2,null,null,"Leeds United",3,2]
["Leicester City",1,4,"",1,null,null,"Leicester City",2,3]
["Liverpool",1,4,"",1,null,null,"Liverpool",3,2]
["Luton Town",null,1,1,4,null,null,"Luton Town",3]
["Manchester City",1,4,"",1,null,null,"Manchester City",5,4]
["Manchester United",1,4,"",1,null,null,"Manchester United",3,2]
["Middlesbrough",1,1,"",4,null,null,"Middlesbrough",2,1]
["Millwall",null,null,1,5,null,null,"Millwall",2,1]
["Newcastle United",1,1,"",4,null,null,"Newcastle United",2,1]
["Norwich City",1,null,"",5,null,null,"Norwich City",1,1]
["Nottingham Forest",null,2,1,3,null,null,"Nottingham Forest",2,4]
["Preston North End",1,2,"",3,null,null,"Preston North End",4,2]
["Queens Park Rangers",null,null,1,5,null,null,"Queens Park Rangers",3]
["Reading",null,null,1,5,null,null,"Reading",3,2]
["Sheffield United",1,null,"",5,null,null,"Sheffield United",3]
["Sheffield Wednesday",1,null,"",5,null,null,"Sheffield Wednesday",2,1]
["Southampton",1,1,"",4,null,null,"Southampton",2,2]
["Stoke City",null,null,1,5,null,null,"Stoke City",4]
["Swansea City",1,3,"",2,null,null,"Swansea City",1,3]
["Tottenham Hotspur",1,2,"",3,null,null,"Tottenham Hotspur",4,3]
["Watford",1,null,"",5,null,null,"Watford",4,2]
["West Bromwich Albion",1,2,"",3,null,null,"West Bromwich Albion",3,2]
["West Ham United",1,3,"",2,null,null,"West Ham United",3,3]
["Wigan Athletic",null,null,1,5,null,null,"Wigan Athletic",2,1]
["Wolverhampton Wanderers",1,2,"",3,null,null,"Wolverhampton Wanderers",2,4]

{"sheet":"Players","index":3,"n_rows":606,"n_cols":9,"rows_kept":606,"cut":false,"hidden":false,"merged":[]}
["Sort ↕","Ref","Cat","Pos","Player","Team","Owner","Bid","Release"]
["A",4999,"A","GK","Bartosz Biakowski","Millwall"]
["A",4289,"A","GK","Jack Butland","Stoke"]
["A",5660,"A","GK","Rafael Cabral","Reading"]
["A",5661,"A","GK","Kamil Grabara","Huddersfield"]
["A",5665,"A","GK","George Long","Hull"]
["A",5375,"A","GK","Joe Lumley","QPR"]
["A",3612,"A","GK","David Marshall","Wigan"]
["A",5370,"A","GK","Rui Patricio","Wolves"]
["A",5589,"A","GK","Samuel Radlinger","Barnsley"]
["A",5656,"A","GK","Aaron Ramsdale","Bournemouth"]
["A",5664,"A","GK","Kelle Roos","Derby"]
["A",5621,"A","GK","Simon Sluga","Luton"]
["B",4540,"A","DEF","Toby Alderweireld","Spurs"]
["B",5018,"A","DEF","Reece Burke","Hull"]
["B",4310,"A","DEF","Nacho Monreal","Arsenal"]
["B",3902,"B","DEF","Kyle Bartley","West Brom"]
["B",5058,"B","DEF","Christopher Schindler","Huddersfield"]
["B",5123,"C","DEF","Semi Ajayi","West Brom"]
["B",5070,"C","DEF","Nathan Ake","Bournemouth"]
["B",4637,"C","DEF","Hector Bellerin","Arsenal"]
["B",5202,"C","DEF","Willy Boly","Wolves"]
["B",5225,"C","DEF","Cameron Carter-Vickers","Stoke"]
["B",5204,"C","DEF","Anders Christensen","Chelsea"]
["B",4365,"C","DEF","Seamus Coleman","Everton"]
["B",4581,"C","DEF","Harlee Dean","Birmingham"]
["B",5042,"C","DEF","Jose Holebas","Watford"]
["B",3455,"C","DEF","Richard Keogh","Derby"]
["B",1962,"C","DEF","Tom Lees","Sheff W"]
["B",3306,"C","DEF","Matthew Lowton","Burnley"]
["B",3141,"C","DEF","Sean Morrison","Cardiff"]
["B",4760,"C","DEF","Tim Ream","Fulham"]
["B",4305,"C","DEF","Danny Rose","Spurs"]
["B",4066,"C","DEF","Ryan Shotton","Middlesbro"]
["B",5593,"C","DEF","Keiran Tierney","Arsenal"]
["B",5348,"C","DEF","Kyle Walker-Peters","Spurs"]
["B",2250,"C","DEF","Andre Wisdom","Derby"]
["B",5493,"D","DEF","Max Aarons","Norwich"]
["B",5582,"D","DEF","Mads Andersen","Barnsley"]
["B",4278,"D","DEF","Daniel Ayala","Middlesbro"]
["B",5069,"D","DEF","Nathan Baker","Bristol C"]
["B",5293,"D","DEF","George Baldock","Sheff U"]
["B",5237,"D","DEF","Yoann Barbet","QPR"]
["B",4697,"D","DEF","Yoann Barbet","Brentford"]
["B",2249,"D","DEF","Danny Batth","Stoke"]
["B",5360,"D","DEF","Jan Bednarak","Southampton"]
["B",5550,"D","DEF","Amari Bell","Blackburn"]
["B",3563,"D","DEF","Joe Bennett","Cardiff"]
["B",4627,"D","DEF","Krystian Bielik","Derby"]
["B",5009,"D","DEF","Tyler Blackett","Reading"]
["B",5617,"D","DEF","Julian Borner","Sheff W"]
["B",5652,"D","DEF","James Bree","Luton"]
["B",5680,"D","DEF","Jaden Brown","Huddersfield"]
["B",4856,"D","DEF","Nathan Byrne","Wigan"]
["B",4093,"D","DEF","Gary Cahill","Palace"]
["B",5387,"D","DEF","Jonny Castro Otto","Wolves"]
["B",3703,"D","DEF","Craig Cathcart","Watford"]
["B",5002,"D","DEF","Cyrus Christie","Fulham"]
["B",3076,"D","DEF","Ciaran Clark","Newcastle"]
["B",4243,"D","DEF","Nathaniel Clyne","Bournemouth"]
["B",5055,"D","DEF","Maxime Colin","Birmingham"]
["B",2860,"D","DEF","Steve Cook","Bournemouth"]
["B",4612,"D","DEF","Jake Cooper","Millwall"]
["B",3531,"D","DEF","Martin Cranie","Luton"]
["B",4915,"D","DEF","Greg Cunningham","Blackburn"]
["B",5357,"D","DEF","Henrik Dalsgaard","Brentford"]
["B",4563,"D","DEF","Charlie Daniels","Bournemouth"]
["B",3613,"D","DEF","Scott Dann","Palace"]
["B",5588,"D","DEF","Jay Dasilva","Bristol C"]
["B",3794,"D","DEF","Craig Dawson","Watford"]
["B",5400,"D","DEF","Jordy de Wijs","Hull"]
["B",5670,"D","DEF","Bambo Diaby","Barnsley"]
["B",4602,"D","DEF","Shane Duffy","Brighton"]
["B",4588,"D","DEF","Paul Dummett","Newcastle"]
["B",5181,"D","DEF","Chey Dunkley","Wigan"]
["B",5683,"D","DEF","Callum Elder","Hull"]
["B",3607,"D","DEF","Ahmed Elmohamady","Villa"]
["B",4919,"D","DEF","Tommy Elphick","Huddersfield"]
["B",5669,"D","DEF","Nathan Ferguson","West Brom"]
["B",4491,"D","DEF","Federico Fernandez","Newcastle"]
["B",5686,"D","DEF","Darnell Fisher","Preston"]
["B",5682,"D","DEF","Brandon Fleming","Hull"]
["B",4767,"D","DEF","Morgan Fox","Sheff W"]
["B",2818,"D","DEF","Daniel Fox","Wigan"]
["B",2190,"D","DEF","Simon Francis","Bournemouth"]
["B",5449,"D","DEF","Kieron Freeman","Sheff U"]
["B",5201,"D","DEF","Dael Fry","Middlesbro"]
["B",5564,"D","DEF","Darnell Furlong","West Brom"]
["B",5011,"D","DEF","Brendan Galloway","Luton"]
["B",5502,"D","DEF","Ben Godfrey","Norwich"]
["B",3256,"D","DEF","Jonathon Grounds","Birmingham"]
["B",5681,"D","DEF","Florent Hadergjonaj","Huddersfield"]
["B",4651,"D","DEF","Grant Hall","QPR"]
["B",4273,"D","DEF","Grant Hanley","Norwich"]
["B",5008,"D","DEF","Kortney Hause","Villa"]
["B",4923,"D","DEF","Rob Holding","Arsenal"]
["B",4078,"D","DEF","Jack Hunt","Bristol C"]
["B",4611,"D","DEF","Shaun Hutchinson","Millwall"]
["B",2783,"D","DEF","Alan Hutton","Villa"]
["B",5007,"D","DEF","Dominic Iorfa","Sheff W"]
["B",4083,"D","DEF","Phil Jagielka","Sheff U"]
["B",5066,"D","DEF","Pontus Jansson","Brentford"]
["B",5505,"D","DEF","Julian Jeanvier","Brentford"]
["B",2674,"D","DEF","Carl Jenkinson","Forest"]
["B",5075,"D","DEF","Christian Kabasele","Watford"]
["B",3861,"D","DEF","Todd Kane","QPR"]
["B",3144,"D","DEF","Martin Kelly","Palace"]
["B",5556,"D","DEF","Kiko","Watford"]
["B",5382,"D","DEF","Cedric Kipre","Wigan"]
["B",4906,"D","DEF","Timm Klose","Norwich"]
["B",2554,"D","DEF","Jamaal Lascelles","Newcastle"]
["B",5470,"D","DEF","Darragh Lenihan","Blackburn"]
["B",5304,"D","DEF","Jamal Lewis","Norwich"]
["B",5586,"D","DEF","Liam Lindsay","Stoke"]
["B",5674,"D","DEF","Tom Lockyer","Charlton"]
["B",5678,"D","DEF","Max Lowe","Derby"]
["B",2945,"D","DEF","Scott Malone","Derby"]
["B",5156,"D","DEF","Cuco Martina","Stoke"]
["B",5228,"D","DEF","Conor McLaughlin","Millwall"]
["B",5542,"D","DEF","Tyrone Mings","Villa"]
{"$rows_left_out":487}
{"sheet":"Owners","index":4,"n_rows":16,"n_cols":1,"rows_kept":16,"cut":false,"hidden":true,"merged":[]}
["Jimmy"]
["Paul/Kel"]
["Brad"]
["Dave"]
["Graham"]
["Mo"]
["Bolshy"]
["Andy"]
["Pete"]
["Fid"]
["John M"]
["John W"]
["Nigel"]
["Griff"]
["Rob/Steve"]
["Antony"]

{"sheet":"Results","index":5,"n_rows":2,"n_cols":10,"rows_kept":2,"cut":false,"hidden":false,"merged":[[0,4,0,8]]}
["`",null,null,null,{"$f":"CONCATENATE(AuctionName,\" - Results\")","v":"DL2020 January Auction R1 - Results"}]
["Winner","Code","Ref","Cat","Pos","Player","Team","Owner","Bid","Released"]

{"sheet":"Signed","index":6,"n_rows":277,"n_cols":8,"rows_kept":277,"cut":false,"hidden":false,"merged":[]}
["Sort","Ref","Cat","Pos","Player","Team","Owner","Bid"]
["A",5366,"A","GK","Alisson","Liverpool","Nigel Hughes",1.5]
["A",5362,"A","GK","Kepa Arrizabalaga","Chelsea","Graham Miller",0.7]
["A",4998,"A","GK","Dan Bentley","Bristol C","Mo Sudell",0.1]
["A",5658,"A","GK","Marcus Bettinelli","Fulham","Graham Miller",0.7]
["A",4051,"A","GK","Lee Camp","Birmingham","Paul Fairhurst",0.1]
["A",5666,"A","GK","Kiki Casilla","Leeds","Steve Waterhouse",1.5]
["A",4141,"A","GK","David De Gea","Man U","Carl Hogg",0.6]
["A",5372,"A","GK","Martin Dubravka","Newcastle","Nigel Heyes",0.7]
["A",5187,"A","GK","Ederson","Man C","Chris Griffin",1.7]
["A",5379,"A","GK","Neil Etheridge","Cardiff","Mo Sudell",0.2]
["A",4420,"A","GK","Lukasz Fabianski","West Ham","Carl Hogg",1.1000000000000001]
["A",4360,"A","GK","Ben Foster","Watford","John Murphy",0.2]
["A",5190,"A","GK","Angus Gunn","Southampton","Dave Sumner",0.5]
["A",3735,"A","GK","Tom Heaton","Villa","John Murphy",0.1]
["A",5371,"A","GK","Dean Henderson","Sheff U","Andy Clucas",0.3]
["A",5151,"A","GK","Sam Johnstone","West Brom","Chris Griffin",0.6]
["A",4198,"A","GK","Tim Krul","Norwich","Dave Sumner",0.1]
["A",5369,"A","GK","Bernd Leno","Arsenal","Jonny Fairclough",0.1]
["A",4309,"A","GK","Hugo Lloris","Spurs","Liam Murphy",1.6]
["A",5663,"A","GK","Dilion Phillips","Charlton","Paul Greenwood",0.1]
["A",4795,"A","GK","Jordan Pickford","Everton","Steve Waterhouse",1.5]
["A",3240,"A","GK","Nick Pope","Burnley","Howard Bradley",1.7]
["A",3734,"A","GK","Darren Randolph","Middlesbro","Paul Fairhurst",0.3]
["A",4793,"A","GK","David Raya Martin","Brentford","Andy Clucas",0.1]
["A",5177,"A","GK","Declan Rudd","Preston","Andy Clucas",0.1]
["A",5192,"A","GK","Matthew Ryan","Brighton","Paul Greenwood",0.1]
["A",5657,"A","GK","Brice Samba","Forest","Nigel Hughes",0.1]
["A",4380,"A","GK","Kasper Schmeichel","Leicester","Howard Bradley",1.9]
["A",5659,"A","GK","Guaita Vincente","Palace","Nigel Heyes",0.8]
["A",5148,"A","GK","Christian Walton","Blackburn","Charlotte Phillips",1.2]
["A",2635,"A","GK","Keiran Westwood","Sheff W","Liam Murphy",0.4]
["A",5662,"A","GK","Freddie Woodman","Swansea","Jonny Fairclough",0.3]
["B",5251,"A","DEF","Trent Alexander-Arnold","Liverpool","Charlotte Phillips",2.1]
["B",3538,"A","DEF","Cesar Azpilicueta","Chelsea","Liam Murphy",0.7]
["B",2901,"A","DEF","Ryan Bennett","Wolves","Steve Waterhouse",0.2]
["B",4810,"A","DEF","Gaetano Berardi","Leeds","Charlotte Phillips",1]
["B",5605,"A","DEF","Joao Cancelo","Man C","Paul Greenwood",1]
["B",4297,"A","DEF","Michael Dawson","Forest","Steve Waterhouse",0.5]
["B",4684,"A","DEF","Christian Fuchs","Leicester","Liam Murphy",1]
["B",3073,"A","DEF","Kieran Gibbs","West Brom","John Murphy",0.8]
["B",4447,"A","DEF","Harry Maguire","Man U","Nigel Hughes",1.1000000000000001]
["B",4968,"A","DEF","Alfie Mawson","Fulham","Steve Waterhouse",1]
["B",3486,"A","DEF","Ben Mee","Burnley","Steve Waterhouse",0.6]
["B",5432,"A","DEF","Yerry Mina","Everton","Andy Clucas",1]
["B",4274,"A","DEF","Lee Peltier","Cardiff","Graham Miller",0.3]
["B",4425,"A","DEF","Luke Shaw","Man U","Graham Miller",0.4]
["B",5068,"A","DEF","Mike van der Hoorn","Swansea","Liam Murphy",1.2]
["B",4799,"A","DEF","Virgil van Dijk","Liverpool","Carl Hogg",2.1]
["B",3622,"A","DEF","Kyle Walker","Man C","Liam Murphy",1.2]
["B",4921,"B","DEF","Jake Bidwell","Swansea","Chris Griffin",0.3]
["B",4778,"B","DEF","Joe Bryan","Fulham","Andy Clucas",0.2]
["B",4590,"B","DEF","Conor Coady","Wolves","Jonny Fairclough",0.2]
["B",5308,"B","DEF","Ben Davies","Preston","Jonny Fairclough",0.2]
["B",5323,"B","DEF","Emerson","Chelsea","Carl Hogg",0.4]
["B",4117,"B","DEF","Jonny Evans","Leicester","Chris Griffin",0.8]
["B",4779,"B","DEF","Aden Flint","Cardiff","Liam Murphy",0.4]
["B",4692,"B","DEF","Joe Gomez","Liverpool","Graham Miller",0.7]
["B",4830,"B","DEF","Tomas Kalas","Bristol C","Jonny Fairclough",0.2]
["B",3795,"B","DEF","Michael Keane","Everton","John Murphy",1]
["B",4140,"B","DEF","David Luiz","Arsenal","Dave Sumner",0.2]
["B",4955,"B","DEF","Paddy McNair","Middlesbro","Charlotte Phillips",1.2]
["B",4757,"B","DEF","Nicolas Otamendi","Man C","Carl Hogg",1]
["B",4671,"B","DEF","Kalvin Phillips","Leeds","Mo Sudell",0.9]
["B",5195,"B","DEF","Davison Sanchez","Spurs","Jonny Fairclough",0.2]
["B",4674,"B","DEF","James Tarkowski","Burnley","Andy Clucas",0.8]
["B",5594,"B","DEF","Aaron Wan-Bissaka","Man U","Dave Sumner",0.3]
["B",5687,"C","DEF","Patrick Bauer","Preston","Mo Sudell",0.1]
["B",4811,"C","DEF","Liam Cooper","Leeds","Andy Clucas",1.1000000000000001]
["B",5417,"C","DEF","Issa Diop","West Ham","Paul Greenwood",0.1]
["B",4474,"C","DEF","Lewis Dunk","Brighton","Nigel Heyes",0.1]
["B",5321,"C","DEF","Aymeric Laporte","Man C","Nigel Heyes",0.7]
["B",5180,"C","DEF","Victor Lindelof","Man U","Howard Bradley",0.3]
["B",5469,"C","DEF","Ricardo Pereira","Leicester","Carl Hogg",1.6]
["B",5464,"C","DEF","Connor Roberts","Swansea","Dave Sumner",0.1]
["B",4845,"C","DEF","Andrew Robertson","Liverpool","Nigel Heyes",1.6]
["B",5397,"C","DEF","Jannik Vestergaard","Southampton","Paul Fairhurst",0.1]
["B",2180,"D","DEF","Luke Ayling","Leeds","Chris Griffin",0.1]
["B",5676,"D","DEF","Sonny Bradley","Luton","Paul Fairhurst",0.1]
["B",5386,"D","DEF","Lucas Digne","Everton","Dave Sumner",1]
["B",5424,"D","DEF","Ryan Fredericks","West Ham","John Murphy",0.1]
["B",4958,"D","DEF","Arthur Masuaku","West Ham","Howard Bradley",0.1]
["B",5064,"D","DEF","Joel Matip","Liverpool","Chris Griffin",0.1]
["B",4182,"D","DEF","Wes Morgan","Leicester","Nigel Hughes",0.2]
["B",3113,"D","DEF","Kyle Naughton","Swansea","Nigel Hughes",0.1]
["B",4852,"D","DEF","Jack O'Connell","Sheff U","Howard Bradley",0.1]
["B",5485,"D","DEF","Kristian Pedersen","Birmingham","Paul Fairhurst",0.1]
["B",5528,"D","DEF","Fabian Schar","Newcastle","Paul Fairhurst",0.1]
["B",5689,"D","DEF","Caglar Soyuncu","Leicester","Mo Sudell",0.3]
["B",2902,"D","DEF","Patrick Van Aanholt","Palace","Howard Bradley",0.1]
["B",5684,"D","DEF","Ben White","Leeds","Nigel Hughes",0.1]
["B",5282,"D","DEF","Joe Worrall","Forest","Paul Greenwood",""]
["C",4197,"A","MID","Albert Adomah","Forest","Graham Miller",1.2]
["C",3496,"A","MID","Michail Antonio","West Ham","Steve Waterhouse",0.1]
["C",5240,"A","MID","Bersant Celina","Swansea","Paul Fairhurst",2]
["C",5176,"A","MID","Bradley Dack","Blackburn","Carl Hogg",1.5]
["C",5039,"A","MID","Jack Grealish","Villa","Charlotte Phillips",0.1]
["C",4368,"A","MID","Will Hughes","Watford","Steve Waterhouse",0.1]
["C",5163,"A","MID","Diogo Jota","Wolves","Andy Clucas",2.5]
["C",4594,"A","MID","Riyad Mahrez","Man C","Paul Greenwood",2.2000000000000002]
["C",5363,"A","MID","John McGinn","Villa","Liam Murphy",2.1]
["C",5143,"A","MID","Ruben Neves","Wolves","Charlotte Phillips",0.5]
["C",4957,"A","MID","Paul Pogba","Man U","John Murphy",3.4]
["C",3899,"A","MID","Jonjo Shelvey","Newcastle","Jonny Fairclough",0.1]
["C",4196,"A","MID","Gylfi Sigurdsson","Everton","Nigel Heyes",4.0999999999999996]
["C",5613,"A","MID","Tiago Silva","Forest","Jonny Fairclough",0.3]
["C",5174,"A","MID","Bernardo Silva","Man C","Liam Murphy",5.3]
["C",4132,"A","MID","David Silva","Man C","Nigel Heyes",2.6]
["C",4788,"A","MID","Heung-Min Son","Spurs","Dave Sumner",7]
["C",4231,"A","MID","Willian","Chelsea","Nigel Hughes",0.5]
["C",5265,"B","MID","Ezgjan Alioski","Leeds","Paul Fairhurst",0.9]
["C",5243,"B","MID","Harvey Barnes","Leicester","Paul Greenwood",0.3]
["C",4256,"B","MID","Tom Cairney","Fulham","Liam Murphy",3.5]
["C",5436,"B","MID","Leo Dendoncker","Wolves","Steve Waterhouse",0.1]
["C",5247,"B","MID","Kieran Dowell","Wigan","John Murphy",2]
["C",5335,"B","MID","Dan James","Man U","Liam Murphy",4.5]
["C",4838,"B","MID","Daniel Johnson","Preston","Paul Fairhurst",2.9]
["C",5242,"B","MID","James Maddison","Leicester","Graham Miller",3]
["C",5262,"B","MID","Luka Milivojevic","Palace","Paul Greenwood",3.2]
["C",5392,"B","MID","Mason Mount","Chelsea","Steve Waterhouse",3.9]
{"$rows_left_out":158}
{"sheet":"SquadSize","index":7,"n_rows":21,"n_cols":6,"rows_kept":21,"cut":false,"hidden":false,"merged":[]}
[]
[]
["Count of Player","Pos"]
["Owner","GK","DEF","MID","FWD","Grand Total"]
["Andy Clucas",3,4,4,7,18]
["Carl Hogg",2,4,5,7,18]
["Charlotte Phillips",1,3,4,6,14]
["Chris Griffin",2,4,4,8,18]
["Dave Sumner",2,4,5,7,18]
["Graham Miller",2,3,5,8,18]
["Howard Bradley",2,4,5,7,18]
["John Murphy",2,3,5,8,18]
["Jonny Fairclough",2,4,3,6,15]
["Liam Murphy",2,5,4,7,18]
["Mo Sudell",2,3,5,8,18]
["Nigel Heyes",2,3,3,5,13]
["Nigel Hughes",2,4,4,8,18]
["Paul Fairhurst",2,4,5,7,18]
["Paul Greenwood",2,3,4,9,18]
["Steve Waterhouse",2,4,5,7,18]
["Grand Total",32,59,70,115,276]

{"sheet":"Spending","index":8,"n_rows":5,"n_cols":3,"rows_kept":5,"cut":false,"hidden":false,"merged":[]}
[]
[]
[null,"Winner","Data"]
[]
["Owner"]